Learn about Centmin Mod LEMP Stack today
Register Now

Nginx [nginx-announce] nginx-1.9.11

Discussion in 'Nginx and PHP-FPM news & discussions' started by eva2000, Feb 10, 2016.

  1. eva2000

    eva2000 Administrator Staff Member

    29,053
    6,594
    113
    May 24, 2014
    Brisbane, Australia
    Ratings:
    +9,790
    Local Time:
    2:50 PM
    Nginx 1.13.x
    MariaDB 5.5
    Changes with nginx 1.9.11 09 Feb 2016

    *) Feature: TCP support in resolver.

    *) Feature: dynamic modules.

    *) Bugfix: the $request_length variable did not include size of request
    headers when using HTTP/2.

    *) Bugfix: in the ngx_http_v2_module.


    --
    Maxim Dounin
    http://nginx.org/

    _______________________________________________
    nginx-announce mailing list
    nginx-announce@nginx.org
    http://mailman.nginx.org/mailman/listinfo/nginx-announce

    Continue reading...
     
    • Like Like x 2
  2. RoldanLT

    RoldanLT Well-Known Member

    3,831
    929
    113
    May 25, 2014
    Phillipines
    Ratings:
    +1,258
    Local Time:
    12:50 PM
    1.11
    10.2
     
    • Like Like x 1
  3. Sunka

    Sunka Active Member

    888
    230
    43
    Oct 31, 2015
    Rijeka, Croatia
    Ratings:
    +376
    Local Time:
    6:50 AM
    Nginx 1.13.3
    MariaDB 10.1.24
    Trying to upgrade three times (from 1.9.10 to 1.9.11), and everything finished OK, except that it shows me that I have 1.9.10 version installed.
    I wrote 1.9.11 when asked me for version to upgrade.

    Code:
    [root@tvor-ocean ~]# nginx -V
    nginx version: nginx/1.9.10
    built by clang 3.4.2 (tags/RELEASE_34/dot2-final)
    built with LibreSSL 2.2.6
    TLS SNI support enabled
    configure arguments: --with-ld-opt='-lrt -ljemalloc -Wl,-z,relro -Wl,-rpath,/usr/local/lib' --with-cc-opt='-m64 -mtune=native -mfpmath=sse -g -O2 -fstack-protector --param=ssp-buffer-size=4 -Wformat -Werror=format-security -Wp,-D_FORTIFY_SOURCE=2 -Wno-sign-compare -Wno-string-plus-int -Wno-deprecated-declarations -Wno-unused-parameter -Wno-unused-const-variable -Wno-conditional-uninitialized -Wno-mismatched-tags -Wno-c++11-extensions -Wno-sometimes-uninitialized -Wno-parentheses-equality -Wno-tautological-compare -Wno-self-assign -Wno-deprecated-register -Wno-deprecated -Wno-invalid-source-encoding -Wno-pointer-sign -Wno-parentheses -Wno-enum-conversion' --sbin-path=/usr/local/sbin/nginx --conf-path=/usr/local/nginx/conf/nginx.conf --with-http_stub_status_module --with-http_secure_link_module --with-openssl-opt=enable-tlsext --add-module=../nginx-module-vts --with-libatomic --with-threads --with-stream --with-stream_ssl_module --with-http_gzip_static_module --add-module=../ngx_brotli --with-http_sub_module --with-http_addition_module --with-http_image_filter_module --with-http_geoip_module --with-http_realip_module --add-module=../nginx-accesskey-2.0.3 --add-module=../nginx-http-concat-master --add-module=../ngx-fancyindex-ngx-fancyindex --add-module=../ngx_cache_purge-2.3 --add-module=../ngx_devel_kit-0.2.19 --add-module=../set-misc-nginx-module-0.29 --add-module=../echo-nginx-module-0.58 --add-module=../redis2-nginx-module-0.12 --add-module=../ngx_http_redis-0.3.7 --add-module=../lua-nginx-module-0.9.20 --add-module=../lua-upstream-nginx-module-0.04 --add-module=../lua-upstream-cache-nginx-module-0.1.1 --add-module=../nginx_upstream_check_module-0.3.0 --add-module=../openresty-memc-nginx-module-4f6f78f --add-module=../openresty-srcache-nginx-module-ffa9ab7 --add-module=../headers-more-nginx-module-0.29 --with-pcre=../pcre-8.38 --with-pcre-jit --with-http_ssl_module --with-http_v2_module --with-openssl=../libressl-2.2.6
     
  4. eva2000

    eva2000 Administrator Staff Member

    29,053
    6,594
    113
    May 24, 2014
    Brisbane, Australia
    Ratings:
    +9,790
    Local Time:
    2:50 PM
    Nginx 1.13.x
    MariaDB 5.5
    did you set /etc/centminmod/custom_config.inc for nginx version ? that overrides centmin.sh set one
     
  5. Sunka

    Sunka Active Member

    888
    230
    43
    Oct 31, 2015
    Rijeka, Croatia
    Ratings:
    +376
    Local Time:
    6:50 AM
    Nginx 1.13.3
    MariaDB 10.1.24
    Just disabled some modules for nginx and some things for php
    Code:
    [root@tvor-ocean ~]# cat /etc/centminmod/custom_config.inc
    NGINX_LIBBROTLI=y # Brotly exension
    NGINX_PAGESPEED=n # nginx page speed
    PHP_MEMCACHE=n # memcache PHP extension
    PHP_MEMCACHED=n # memcached PHP extension
     
  6. eva2000

    eva2000 Administrator Staff Member

    29,053
    6,594
    113
    May 24, 2014
    Brisbane, Australia
    Ratings:
    +9,790
    Local Time:
    2:50 PM
    Nginx 1.13.x
    MariaDB 5.5
    those should not interfere with version of nginx chosen

    To troubleshoot, you need to check the the nginx upgrade log at /root/centminlogs and instructions under Sharing logs and errors heading for using Pastebin.com or Gists to share a sanitised version of the contents of the initial install log. You can see full details at How to troubleshoot Centmin Mod initial install issues
     
    • Like Like x 1
  7. eva2000

    eva2000 Administrator Staff Member

    29,053
    6,594
    113
    May 24, 2014
    Brisbane, Australia
    Ratings:
    +9,790
    Local Time:
    2:50 PM
    Nginx 1.13.x
    MariaDB 5.5
    ah i see nginx 1.9.11 compilation fails on 123.09beta01 due to conflict with ngx_pagespeed 1.9.32.13

    as @RoldanLT doesn't have ngx_pagespeed enabled he installed 1.9.11 fine
    Code:
    /api -I ../nginx_upstream_check_module-0.3.0 -I ../pcre-8.38 -I ../libressl-2.2.6/.openssl/include -I objs -I src/http -I src/http/modules -I src/http/v2 -I ../ngx_devel_kit-0.2.19/src -I src/stream \
            -o objs/addon/src/ngx_pagespeed.o \
            ../ngx_pagespeed-release-1.9.32.13-beta/src/ngx_pagespeed.cc
    ../ngx_pagespeed-release-1.9.32.13-beta/src/ngx_pagespeed.cc:3185:3: error: conversion from string literal to 'char *' is deprecated [-Werror,-Wc++11-compat-deprecated-writable-strings]
      NGX_MODULE_V1,
      ^
    src/core/ngx_module.h:241:32: note: expanded from macro 'NGX_MODULE_V1'
        NULL, 0, 0, nginx_version, NGX_MODULE_SIGNATURE
                                   ^
    src/core/ngx_module.h:225:5: note: expanded from macro 'NGX_MODULE_SIGNATURE'
        NGX_MODULE_SIGNATURE_0 NGX_MODULE_SIGNATURE_1 NGX_MODULE_SIGNATURE_2      \
        ^
    src/core/ngx_module.h:22:5: note: expanded from macro 'NGX_MODULE_SIGNATURE_0'
        ngx_value(NGX_PTR_SIZE) ","                                               \
        ^
    src/core/ngx_string.h:231:31: note: expanded from macro 'ngx_value'
    #define ngx_value(n)          ngx_value_helper(n)
                                  ^
    src/core/ngx_string.h:230:31: note: expanded from macro 'ngx_value_helper'
    #define ngx_value_helper(n)   #n
                                  ^
    <scratch space>:135:1: note: expanded from here
    "8"
    ^
    ../ngx_pagespeed-release-1.9.32.13-beta/src/ngx_pagespeed.cc:3200:3: error: conversion from string literal to 'char *' is deprecated [-Werror,-Wc++11-compat-deprecated-writable-strings]
      NGX_MODULE_V1,
      ^
    src/core/ngx_module.h:241:32: note: expanded from macro 'NGX_MODULE_V1'
        NULL, 0, 0, nginx_version, NGX_MODULE_SIGNATURE
                                   ^
    src/core/ngx_module.h:225:5: note: expanded from macro 'NGX_MODULE_SIGNATURE'
        NGX_MODULE_SIGNATURE_0 NGX_MODULE_SIGNATURE_1 NGX_MODULE_SIGNATURE_2      \
        ^
    src/core/ngx_module.h:22:5: note: expanded from macro 'NGX_MODULE_SIGNATURE_0'
        ngx_value(NGX_PTR_SIZE) ","                                               \
        ^
    src/core/ngx_string.h:231:31: note: expanded from macro 'ngx_value'
    #define ngx_value(n)          ngx_value_helper(n)
                                  ^
    src/core/ngx_string.h:230:31: note: expanded from macro 'ngx_value_helper'
    #define ngx_value_helper(n)   #n
                                  ^
    <scratch space>:137:1: note: expanded from here
    "8"
    ^
    2 errors generated.
    make[1]: *** [objs/addon/src/ngx_pagespeed.o] Error 1
    make[1]: Leaving directory `/svr-setup/nginx-1.9.11'
    make: *** [install] Error 2
    
    real    0m1.129s
    user    0m1.049s
    sys     0m0.078s
    if you get past error
    Code:
    error: conversion from string literal to 'char *' is deprecated [-Werror,-Wc++11-compat-deprecated-writable-strings]
      NGX_MODULE_V1,
      ^
    you end up with this error at make stage, looks like conflict with ngxin lua-nginx-module
    Code:
            ../lua-nginx-module-0.9.20/src/ngx_http_lua_pcrefix.c
    In file included from ../lua-nginx-module-0.9.20/src/ngx_http_lua_util.c:38:
    ../lua-nginx-module-0.9.20/src/ngx_http_lua_socket_udp.h:34:5: error: unknown type name 'ngx_udp_connection_t'
        ngx_udp_connection_t             udp_connection;
        ^
    1 error generated.
    make[1]: *** [objs/addon/src/ngx_http_lua_util.o] Error 1
    make[1]: *** Waiting for unfinished jobs....
    make[1]: Leaving directory `/svr-setup/nginx-1.9.11'
    make: *** [build] Error 2
    at make install
    Code:
    make[1]: Entering directory `/svr-setup/nginx-1.9.11'
    ccache /usr/bin/clang -ferror-limit=0 -c -I/usr/local/include/luajit-2.1  -pipe  -O -Wall -Wextra -Wpointer-arith -Wconditional-uninitialized -Wno-unused-parameter -Werror -g -m64 -mtune=native -mfpmath=sse -g -O2 -fstack-protector --param=ssp-buffer-size=4 -Wformat -Werror=format-security -Wp,-D_FORTIFY_SOURCE=2 -Wno-sign-compare -Wno-string-plus-int -Wno-deprecated-declarations -Wno-unused-parameter -Wno-unused-const-variable -Wno-conditional-uninitialized -Wno-mismatched-tags -Wno-c++11-extensions -Wno-sometimes-uninitialized -Wno-parentheses-equality -Wno-tautological-compare -Wno-self-assign -Wno-deprecated-register -Wno-deprecated -Wno-invalid-source-encoding -Wno-pointer-sign -Wno-parentheses -Wno-enum-conversion -Wno-c++11-compat-deprecated-writable-strings  -DNDK_SET_VAR -DNDK_UPSTREAM_LIST -DNDK_SET_VAR  -I src/core -I src/event -I src/event/modules -I src/os/unix -I ../ngx_pagespeed-release-1.9.32.13-beta/psol/include -I ../ngx_pagespeed-release-1.9.32.13-beta/psol/include/third_party/chromium/src -I ../ngx_pagespeed-release-1.9.32.13-beta/psol/include/third_party/google-sparsehash/src -I ../ngx_pagespeed-release-1.9.32.13-beta/psol/include/third_party/google-sparsehash/gen/arch/linux/x64/include -I ../ngx_pagespeed-release-1.9.32.13-beta/psol/include/third_party/protobuf/src -I ../ngx_pagespeed-release-1.9.32.13-beta/psol/include/third_party/re2/src -I ../ngx_pagespeed-release-1.9.32.13-beta/psol/include/out/Release/obj/gen -I ../ngx_pagespeed-release-1.9.32.13-beta/psol/include/out/Release/obj/gen/protoc_out/instaweb -I ../ngx_pagespeed-release-1.9.32.13-beta/psol/include/third_party/apr/src/include -I ../ngx_pagespeed-release-1.9.32.13-beta/psol/include/third_party/aprutil/src/include -I ../ngx_pagespeed-release-1.9.32.13-beta/psol/include/third_party/apr/gen/arch/linux/x64/include -I ../ngx_pagespeed-release-1.9.32.13-beta/psol/include/third_party/aprutil/gen/arch/linux/x64/include -I ../ngx_devel_kit-0.2.19/objs -I objs/addon/ndk -I /usr/local/include/luajit-2.1 -I ../lua-nginx-module-0.9.20/src/api -I ../nginx_upstream_check_module-0.3.0 -I ../pcre-8.38 -I ../libressl-2.2.6/.openssl/include -I objs -I src/http -I src/http/modules -I src/http/v2 -I ../ngx_devel_kit-0.2.19/src -I src/stream \
            -o objs/addon/src/ngx_http_lua_util.o \
            ../lua-nginx-module-0.9.20/src/ngx_http_lua_util.c
    In file included from ../lua-nginx-module-0.9.20/src/ngx_http_lua_util.c:38:
    ../lua-nginx-module-0.9.20/src/ngx_http_lua_socket_udp.h:34:5: error: unknown type name 'ngx_udp_connection_t'
        ngx_udp_connection_t             udp_connection;
        ^
    1 error generated.
    make[1]: *** [objs/addon/src/ngx_http_lua_util.o] Error 1
    make[1]: Leaving directory `/svr-setup/nginx-1.9.11'
    make: *** [install] Error 2
     
    Last edited: Feb 10, 2016
    • Like Like x 2
    • Agree Agree x 1
  8. eva2000

    eva2000 Administrator Staff Member

    29,053
    6,594
    113
    May 24, 2014
    Brisbane, Australia
    Ratings:
    +9,790
    Local Time:
    2:50 PM
    Nginx 1.13.x
    MariaDB 5.5
  9. Matt

    Matt Moderator Staff Member

    680
    314
    63
    May 25, 2014
    Sheffield, UK
    Ratings:
    +433
    Local Time:
    5:50 AM
    1.7.1
    MariaDB 10
    Just had the same issue myself, and it failed back to 1.9.10
     
    • Like Like x 1
  10. eva2000

    eva2000 Administrator Staff Member

    29,053
    6,594
    113
    May 24, 2014
    Brisbane, Australia
    Ratings:
    +9,790
    Local Time:
    2:50 PM
    Nginx 1.13.x
    MariaDB 5.5
    yup as install didn't complete it's still on previous nginx version you had :)

    I expect the 1.9.11 dynamic module support changes will break alot of 3rd party nginx modules initially heh
     
  11. Sunka

    Sunka Active Member

    888
    230
    43
    Oct 31, 2015
    Rijeka, Croatia
    Ratings:
    +376
    Local Time:
    6:50 AM
    Nginx 1.13.3
    MariaDB 10.1.24
    Strange, cause I do not have enabled ngx_pagespeed too => NGINX_PAGESPEED=n
    Code:
    [root@tvor-ocean ~]# cat /etc/centminmod/custom_config.inc
    NGINX_LIBBROTLI=y # Brotly exension
    NGINX_PAGESPEED=n # nginx page speed
    PHP_MEMCACHE=n # memcache PHP extension
    PHP_MEMCACHED=n # memcached PHP extension
     
  12. eva2000

    eva2000 Administrator Staff Member

    29,053
    6,594
    113
    May 24, 2014
    Brisbane, Australia
    Ratings:
    +9,790
    Local Time:
    2:50 PM
    Nginx 1.13.x
    MariaDB 5.5
    probably another nginx module conflict, to troubleshoot, you need to check the the nginx upgrade log at /root/centminlogs and instructions under Sharing logs and errors heading for using Pastebin.com or Gists to share a sanitised version of the contents of the initial install log. You can see full details at How to troubleshoot Centmin Mod initial install issues
     
  13. eva2000

    eva2000 Administrator Staff Member

    29,053
    6,594
    113
    May 24, 2014
    Brisbane, Australia
    Ratings:
    +9,790
    Local Time:
    2:50 PM
    Nginx 1.13.x
    MariaDB 5.5
    looks like lua-nginx-module also has conflicts


    if you get past error
    Code:
    error: conversion from string literal to 'char *' is deprecated [-Werror,-Wc++11-compat-deprecated-writable-strings]
      NGX_MODULE_V1,
      ^
    you end up with this error at make stage, looks like conflict with ngxin lua-nginx-module
    Code:
            ../lua-nginx-module-0.9.20/src/ngx_http_lua_pcrefix.c
    In file included from ../lua-nginx-module-0.9.20/src/ngx_http_lua_util.c:38:
    ../lua-nginx-module-0.9.20/src/ngx_http_lua_socket_udp.h:34:5: error: unknown type name 'ngx_udp_connection_t'
        ngx_udp_connection_t             udp_connection;
        ^
    1 error generated.
    make[1]: *** [objs/addon/src/ngx_http_lua_util.o] Error 1
    make[1]: *** Waiting for unfinished jobs....
    make[1]: Leaving directory `/svr-setup/nginx-1.9.11'
    make: *** [build] Error 2
    at make install
    Code:
    make[1]: Entering directory `/svr-setup/nginx-1.9.11'
    ccache /usr/bin/clang -ferror-limit=0 -c -I/usr/local/include/luajit-2.1  -pipe  -O -Wall -Wextra -Wpointer-arith -Wconditional-uninitialized -Wno-unused-parameter -Werror -g -m64 -mtune=native -mfpmath=sse -g -O2 -fstack-protector --param=ssp-buffer-size=4 -Wformat -Werror=format-security -Wp,-D_FORTIFY_SOURCE=2 -Wno-sign-compare -Wno-string-plus-int -Wno-deprecated-declarations -Wno-unused-parameter -Wno-unused-const-variable -Wno-conditional-uninitialized -Wno-mismatched-tags -Wno-c++11-extensions -Wno-sometimes-uninitialized -Wno-parentheses-equality -Wno-tautological-compare -Wno-self-assign -Wno-deprecated-register -Wno-deprecated -Wno-invalid-source-encoding -Wno-pointer-sign -Wno-parentheses -Wno-enum-conversion -Wno-c++11-compat-deprecated-writable-strings  -DNDK_SET_VAR -DNDK_UPSTREAM_LIST -DNDK_SET_VAR  -I src/core -I src/event -I src/event/modules -I src/os/unix -I ../ngx_pagespeed-release-1.9.32.13-beta/psol/include -I ../ngx_pagespeed-release-1.9.32.13-beta/psol/include/third_party/chromium/src -I ../ngx_pagespeed-release-1.9.32.13-beta/psol/include/third_party/google-sparsehash/src -I ../ngx_pagespeed-release-1.9.32.13-beta/psol/include/third_party/google-sparsehash/gen/arch/linux/x64/include -I ../ngx_pagespeed-release-1.9.32.13-beta/psol/include/third_party/protobuf/src -I ../ngx_pagespeed-release-1.9.32.13-beta/psol/include/third_party/re2/src -I ../ngx_pagespeed-release-1.9.32.13-beta/psol/include/out/Release/obj/gen -I ../ngx_pagespeed-release-1.9.32.13-beta/psol/include/out/Release/obj/gen/protoc_out/instaweb -I ../ngx_pagespeed-release-1.9.32.13-beta/psol/include/third_party/apr/src/include -I ../ngx_pagespeed-release-1.9.32.13-beta/psol/include/third_party/aprutil/src/include -I ../ngx_pagespeed-release-1.9.32.13-beta/psol/include/third_party/apr/gen/arch/linux/x64/include -I ../ngx_pagespeed-release-1.9.32.13-beta/psol/include/third_party/aprutil/gen/arch/linux/x64/include -I ../ngx_devel_kit-0.2.19/objs -I objs/addon/ndk -I /usr/local/include/luajit-2.1 -I ../lua-nginx-module-0.9.20/src/api -I ../nginx_upstream_check_module-0.3.0 -I ../pcre-8.38 -I ../libressl-2.2.6/.openssl/include -I objs -I src/http -I src/http/modules -I src/http/v2 -I ../ngx_devel_kit-0.2.19/src -I src/stream \
            -o objs/addon/src/ngx_http_lua_util.o \
            ../lua-nginx-module-0.9.20/src/ngx_http_lua_util.c
    In file included from ../lua-nginx-module-0.9.20/src/ngx_http_lua_util.c:38:
    ../lua-nginx-module-0.9.20/src/ngx_http_lua_socket_udp.h:34:5: error: unknown type name 'ngx_udp_connection_t'
        ngx_udp_connection_t             udp_connection;
        ^
    1 error generated.
    make[1]: *** [objs/addon/src/ngx_http_lua_util.o] Error 1
    make[1]: Leaving directory `/svr-setup/nginx-1.9.11'
    make: *** [install] Error 2
     
    • Like Like x 1
  14. Sunka

    Sunka Active Member

    888
    230
    43
    Oct 31, 2015
    Rijeka, Croatia
    Ratings:
    +376
    Local Time:
    6:50 AM
    Nginx 1.13.3
    MariaDB 10.1.24
    I have that error for Brotli
     
    • Informative Informative x 1
  15. eva2000

    eva2000 Administrator Staff Member

    29,053
    6,594
    113
    May 24, 2014
    Brisbane, Australia
    Ratings:
    +9,790
    Local Time:
    2:50 PM
    Nginx 1.13.x
    MariaDB 5.5
  16. Sunka

    Sunka Active Member

    888
    230
    43
    Oct 31, 2015
    Rijeka, Croatia
    Ratings:
    +376
    Local Time:
    6:50 AM
    Nginx 1.13.3
    MariaDB 10.1.24
  17. eva2000

    eva2000 Administrator Staff Member

    29,053
    6,594
    113
    May 24, 2014
    Brisbane, Australia
    Ratings:
    +9,790
    Local Time:
    2:50 PM
    Nginx 1.13.x
    MariaDB 5.5
    ah yes same error
    Code:
    make -f objs/Makefile install
    make[1]: Entering directory `/svr-setup/nginx-1.9.11'
    ccache /usr/bin/clang -ferror-limit=0 -c -I/usr/local/include/luajit-2.1  -pipe  -O -Wall -Wextra -Wpointer-arith -Wconditional-uninitialized -Wno-unused-parameter -Werror -g -m64 -mtune=native -mfpmath=sse -g -O2 -fstack-protector --param=ssp-buffer-size=4 -Wformat -Werror=format-security -Wp,-D_FORTIFY_SOURCE=2 -Wno-sign-compare -Wno-string-plus-int -Wno-deprecated-declarations -Wno-unused-parameter -Wno-unused-const-variable -Wno-conditional-uninitialized -Wno-mismatched-tags -Wno-c++11-extensions -Wno-sometimes-uninitialized -Wno-parentheses-equality -Wno-tautological-compare -Wno-self-assign -Wno-deprecated-register -Wno-deprecated -Wno-invalid-source-encoding -Wno-pointer-sign -Wno-parentheses -Wno-enum-conversion -DNDK_SET_VAR -DNDK_UPSTREAM_LIST -DNDK_SET_VAR  -I src/core -I src/event -I src/event/modules -I src/os/unix -I ../ngx_devel_kit-0.2.19/objs -I objs/addon/ndk -I /usr/local/include/luajit-2.1 -I ../lua-nginx-module-0.9.20/src/api -I ../nginx_upstream_check_module-0.3.0 -I ../pcre-8.38 -I ../libressl-2.2.6/.openssl/include -I objs -I src/http -I src/http/modules -I src/http/v2 -I ../ngx_devel_kit-0.2.19/src -I src/stream \
        -o objs/addon/src/ngx_http_brotli_filter_module.o \
        ../ngx_brotli/src/ngx_http_brotli_filter_module.cc
    ../ngx_brotli/src/ngx_http_brotli_filter_module.cc:161:5: error: conversion from string literal to 'char *' is deprecated [-Werror,-Wc++11-compat-deprecated-writable-strings]
        NGX_MODULE_V1,
        ^
    src/core/ngx_module.h:241:32: note: expanded from macro 'NGX_MODULE_V1'
        NULL, 0, 0, nginx_version, NGX_MODULE_SIGNATURE
                                   ^
    src/core/ngx_module.h:225:5: note: expanded from macro 'NGX_MODULE_SIGNATURE'
        NGX_MODULE_SIGNATURE_0 NGX_MODULE_SIGNATURE_1 NGX_MODULE_SIGNATURE_2      \
        ^
    src/core/ngx_module.h:22:5: note: expanded from macro 'NGX_MODULE_SIGNATURE_0'
        ngx_value(NGX_PTR_SIZE) ","                                               \
        ^
    src/core/ngx_string.h:231:31: note: expanded from macro 'ngx_value'
    #define ngx_value(n)          ngx_value_helper(n)
                                  ^
    src/core/ngx_string.h:230:31: note: expanded from macro 'ngx_value_helper'
    #define ngx_value_helper(n)   #n
                                  ^
    <scratch space>:50:1: note: expanded from here
    "8"
    ^
    1 error generated.
    make[1]: *** [objs/addon/src/ngx_http_brotli_filter_module.o] Error 1
    make[1]: Leaving directory `/svr-setup/nginx-1.9.11'
    make: *** [install] Error 2
    once you get past that there's more errors anyway

    Code:
    nginx -V
    nginx: error while loading shared libraries: libbrotlienc.so.1: cannot open shared object file: No such file or directory
     
    • Like Like x 1
  18. eva2000

    eva2000 Administrator Staff Member

    29,053
    6,594
    113
    May 24, 2014
    Brisbane, Australia
    Ratings:
    +9,790
    Local Time:
    2:50 PM
    Nginx 1.13.x
    MariaDB 5.5
    so far looks like lua-nginx-module, ngx_brotli and ngx_pagespeed are modules with errors for nginx 1.9.11 on centmin mod 123.09beta01

    ngx_brotli is 123.09beta01 specific module so 123.08stable users wouldn't apply
    Code:
    configuring additional modules
    adding module in ../nginx-module-vts
    + ngx_http_vhost_traffic_status_module was configured
    adding module in ../ngx_brotli
    checking for Brotli library ... found
    sed: -e expression #1, char 0: no previous regular expression
    + ngx_brotli was configured
    adding module in ../ngx_pagespeed-release-1.9.32.13-beta
    mod_pagespeed_dir=../ngx_pagespeed-release-1.9.32.13-beta/psol/include
    build_from_source=false
    checking for psol ... found
    sed: -e expression #1, char 0: no previous regular expression
    sed: -e expression #1, char 0: no previous regular expression
    List of modules (in reverse order of applicability): 
    rest of modules look fine
    Code:
    configuring additional modules
    adding module in ../nginx-module-vts
    + ngx_http_vhost_traffic_status_module was configured
    adding module in ../ngx_brotli
    checking for Brotli library ... found
    sed: -e expression #1, char 0: no previous regular expression
    + ngx_brotli was configured
    adding module in ../ngx_pagespeed-release-1.9.32.13-beta
    mod_pagespeed_dir=../ngx_pagespeed-release-1.9.32.13-beta/psol/include
    build_from_source=false
    checking for psol ... found
    sed: -e expression #1, char 0: no previous regular expression
    sed: -e expression #1, char 0: no previous regular expression
    List of modules (in reverse order of applicability):
    + ngx_pagespeed was configured
    adding module in ../nginx-accesskey-2.0.3
    + ngx_http_accesskey_module was configured
    adding module in ../nginx-http-concat-master
    + ngx_http_concat_module was configured
    adding module in ../ngx-fancyindex-ngx-fancyindex
    + ngx_http_fancyindex_module was configured
    adding module in ../ngx_cache_purge-2.3
    + ngx_http_cache_purge_module was configured
    adding module in ../ngx_devel_kit-0.2.19
    + ngx_devel_kit was configured
    adding module in ../set-misc-nginx-module-0.29
    found ngx_devel_kit for ngx_set_misc; looks good.
    + ngx_http_set_misc_module was configured
    adding module in ../echo-nginx-module-0.58
    + ngx_http_echo_module was configured
    adding module in ../redis2-nginx-module-0.12
    + ngx_http_redis2_module was configured
    adding module in ../ngx_http_redis-0.3.7
    + ngx_http_redis_module was configured
    adding module in ../nginx_upstream_check_module-0.3.0
    checking for ngx_http_upstream_check_module ... found
    + ngx_http_upstream_check_module was configured
    adding module in ../openresty-memc-nginx-module-4f6f78f
    + ngx_http_memc_module was configured
    adding module in ../openresty-srcache-nginx-module-ffa9ab7
    + ngx_http_srcache_filter_module was configured
    adding module in ../headers-more-nginx-module-0.29
    + ngx_http_headers_more_filter_module was configure
     
    • Like Like x 1
  19. eva2000

    eva2000 Administrator Staff Member

    29,053
    6,594
    113
    May 24, 2014
    Brisbane, Australia
    Ratings:
    +9,790
    Local Time:
    2:50 PM
    Nginx 1.13.x
    MariaDB 5.5
  20. eva2000

    eva2000 Administrator Staff Member

    29,053
    6,594
    113
    May 24, 2014
    Brisbane, Australia
    Ratings:
    +9,790
    Local Time:
    2:50 PM
    Nginx 1.13.x
    MariaDB 5.5
    if you don't use those problematic modules try using persistent config file /etc/centminmod/custom_config.inc setup for
    Code:
    NGINX_PAGESPEED=n
    NGINX_LIBBROTLI='n'
    LUAJIT_GITINSTALL='n'
    ORESTY_LUANGINX='n'
    
    then run centmin.sh menu option 4 to recompile nginx with 1.9.11 version

    for 123.09beta01 you end up with